{"text_format":"1","workbook":"xlsx","n_sheets":5,"sheets":["2022","Acerno_Cache_XXXXX","2. Mapa de Calor","Matriz Calificacion","varios"],"not_rendered":{"charts":0,"images":7,"macros":0,"external_links":0,"defined_names":17,"comments":1,"pivot_tables":0},"unopened":[],"bounds":{"document_bytes":16777216,"sheet_cells":100000,"rows_first":2000,"rows_last":500,"rows_between":2000,"halvings":0,"cell_chars":16384,"cell_head_chars":4096},"cells_cut":0,"cells_raw":0,"read":"whole","date_system":"1900"}

{"sheet":"2022","index":0,"n_rows":23,"n_cols":50,"rows_kept":23,"cut":false,"hidden":false,"merged":[[7,37,8,37],[7,36,8,36],[7,38,8,38],[7,39,8,39],[7,40,8,40],[7,46,8,46],[7,47,8,47],[7,48,8,48],[7,49,8,49],[7,41,8,41],[7,42,8,42],[7,43,8,43],[7,44,8,44],[7,45,8,45],[7,33,8,33],[7,34,8,34],[7,35,8,35],[22,0,22,1],[7,0,8,0],[7,1,8,1],[7,2,8,2],[7,3,8,3],[7,30,8,30],[21,0,21,1],[7,31,8,31],[7,32,8,32],[0,0,1,1],[0,2,1,48],[2,0,2,3],[2,4,2,24],[2,25,2,27],[2,28,2,29],[2,30,2,38],[2,39,2,42],[2,43,2,47],[2,48,2,49]]}
[null,null,"SEGUIMIENTO MAPA DE RIESGOS DE CORRUPCÍON DESDE LA OFICINA ASESORA DE AUDITORÍA INTERNA CON CORTE DICIEMBRE 2022",null,null,null,null,null,null,null,null,null,null,null,null,null,null,null,null,null,null,null,null,null,null,null,null,null,null,null,null,null,null,null,null,null,null,null,null,null,null,null,null,null,null,null,null,null,null,"Código: PI-F-25"]
[null,null,null,null,null,null,null,null,null,null,null,null,null,null,null,null,null,null,null,null,null,null,null,null,null,null,null,null,null,null,null,null,null,null,null,null,null,null,null,null,null,null,null,null,null,null,null,null,null,"Versión: 03"]
["IDENTIFICACIÓN DEL RIESGO",null,null,null,"IMPACTO\nSi el riesgo de corrupción se materializa, podría:",null,null,null,null,null,null,null,null,null,null,null,null,null,null,null,null,null,null,null,null,"PROBABILIDAD",null,null,"CALIFICACIÓN RIESGO INICIAL",null,"CONTROLES ACTUALES",null,null,null,null,null,null,null,null,"CALIFICACIÓN RIESGO RESIDUAL\n(CON CONTROLES ACTUALES) \n",null,null,null,"PLAN DE TRATAMIENTO EN CASO DE MATERIALIZACIÓN DEL RIESGO",null,null,null,null,"SEGUIMIENTO"]
["NRO","DESCRIPCIÓN DEL RIESGO DE CORRUPCIÓN\n(Posibilidad de que por acción u omisión se use el poder para desviar la gestión de lo público hacia un beneficio privado)","CAUSAS O SITUACIONES RELACIONADAS AL AGENTE GENERADOR QUE PUEDEN ORIGINAR PRÁCTICAS CORRUPTAS","EFECTOS O CONSECUENCIAS DE LA DEPENDENCIA / PROCESO\n(Pérdida, daño, detrimento, perjuicio, etc.)","¿Afectar al grupo de funcionarios del proceso / dependencia?","¿Afectar el cumplimiento de metas y objetivos de la dependencia?","¿Afectar el cumplimiento de misión de la Entidad?","¿Afectar el cumplimiento de la misión del sector al que pertenece la Entidad?","¿Generar pérdida de confianza de la Entidad, afectando su reputación?","¿Generar pérdida de recursos económicos?","¿Afectar la generación de los productos o la prestación de servicios?","¿Dar lugar al detrimento de calidad de vida de la comunidad por la pérdida del bien o servicios o los recursos públicos?","¿Generar pérdida de información de la Entidad?","¿Generar intervención de los órganos de control, de la Fiscalía, ¿u otro ente?","¿Dar lugar a procesos sancionatorios?","¿Dar lugar a procesos disciplinarios?","¿Dar lugar a procesos fiscales?","¿Dar lugar a procesos penales?","¿Generar pérdida de credibilidad del sector?","¿Ocasionar lesiones físicas o pérdida de vidas humanas?","¿Afectar la imagen regional?","¿Afectar la imagen nacional?","¿Generar daño ambiental?","Valor","Categoría","Frecuencia","Valor","Categoría","VALOR RIESGO INICIAL ","NIVEL RIESGO INICIAL","DESCRIBA LOS CONTROLES ACTUALES","CARGO RESPONSABLE",null,"EVALUACIÓN\n(Realizado por la Oficina Asesora de Auditoría Interna)","DOCUMENTADO","AUTOMATICO","RESPONSABLE","SE EJECUTA PERIODICAMENTE","MODIFICA IMPACTO O PROBABILIDAD","IMPACTO","PROBABILIDAD","VALOR RIESGO RESIDUAL","NIVEL DE RIESGO RESIDUAL","ACTIVIDADES PROPUESTAS\n(NUEVAS)","EVIDENCIA O SOPORTE","RESPONSABLES\n(Cargo)","FECHA DE INICIO","FECHA ESPERADA DE TERMINACIÓN","DESCRIBA CUALITATIVAMENTE EL AVANCE O RESULTADO DE LA ACTIVIDAD\n","AVANCE DE LA ACTIVIDAD EN\nPORCENTAJE (%)"]
["R1","Posibilidad de recibir o solicitar cualquier dádiva o beneficio a nombre propio o de terceros con el fin de celebrar un contrato","Falta de conocimiento de la ley, omisión de procedimientos legales/Fallas en la intención de favorecer a alguien en particular/Mal actuar de un servidor público violando los controles establecidos/ Paradigmas distorsionados y negativos","Detrimento Patrimonial por efecto de inversiones mal direccionadas y mala imagen institucional/ Falta de equidad/  incumplimiento de los objetivos de la Institución/ Falta de canales de comunicación para los grupos de valor ","Si","Si","Si","Si","Si","Si","No","No","No","Si","Si","Si","Si","Si","Si","No","Si","Si","No",{"$f":"COUNTIF($E5:$W5, \"Si\")","v":14},{"$f":"IF($X5 = 0, \"No Aplica\", IF($X5 <= 5, \"Moderado\", IF($X5 <= 11, \"Mayor\", \"Catastrófico\")))","v":"Catastrófico"},"No se ha presentado en los últimos 5 años",{"$f":"IF(Z5=\"Más de una vez al año\",\"5\",IF(Z5=\"Al menos una vez en el último año\",\"4\",IF(Z5=\"Al menos una vez en los últimos dos años\",\"3\",IF(Z5=\"Al menos una vez en los últimos 5 años\",\"2\",\"1\"))))","v":"1"},{"$f":"IF(AA5=\"5\",\"Casi seguro\",IF(AA5=\"4\",\"Probable\",IF(AA5=\"3\",\"Posible\",IF(AA5=\"2\",\"Improbable\",\"Rara vez\"))))","v":"Rara vez"},{"$f":"IF(Y5 = \"Moderado\", 5, IF(Y5 = \"Mayor\", 10, IF(Y5 = \"Catastrófico\", 20, 0)))*AA5","v":20},{"$f":"VLOOKUP($AB5, varios!$Z$3:$AC$7, VLOOKUP($Y5, varios!$AE$2:$AF$4, 2, FALSE),FALSE)","v":"Moderado"},"1. Ejecutar el manual de Contratación Supervisión e interventoría.\n2. Realizar campañas de sensibilización del manejo adecuado del manual de contratación, supervisión e interventoría. \n3. Realizar capacitación en procesos y responsabilidades contractuales.\n","1. Todos los funcionarios de la institución que ejerzan el rol de supervisor.\n2. Secretaría General\n3. Secretaría General ","1. Se cuenta con el Manual de contratación y Supervisión e Interventoría. URL: https://drive.google.com/file/d/10g8AOXzxsoUmLOH7JGgLnAHqvhXGJU5M/view?ts=619d5c19  https://drive.google.com/file/d/14f9TRjR1nsomA5Mp9_2vDFZMhisA32wz/view?ts=619d5b97\n\nEn este momento el manual de contratación de la IU. Digital de Antioquia se encuentra en modificación por parte de la dirección jurídica y se están realizando ajustes y actualizaciones normativas. https://docs.google.com/document/d/1iP0Mc3fIInZnzioHFhSpFKjg5FIlPgnz/edit?usp=sharing&ouid=113699892593678301733&rtpof=true&sd=true \n\nSe evidencia lista de chequeo para elaboración de los contratos y formato de informe de supervisión y/o interventoría que incluye el acta de recibo a satisfacción.\n\nLos contratos y sus soportes se encuentran cargados en la plataforma de SIA Observa y Secop.\n\n2.Las campañas se realizarán acorde a las necesidades institucionales. \nSe realiza modificación a informe de supervisión y se realiza capacitación a los supervisores:\n https://docs.google.com/document/d/11dN1L_JgMq8vffpqrUURqXXe1hyCg5IV/edit?rtpof=true&sd=true                                                                                                 https://drive.google.com/file/d/1BphxHno4wFMlyxwoWScy6sYf_-FdEk5t/view   \n\nEl Manual de Compras y Contratación se encuentra en ajustes por parte del área de contratación (a la fecha presenta un avance del 90%) se programará la campaña de comunicación y capacitación.                                                                                                                                                                                                                                                                      \nDe manera adicional, por la secretaría general se emitió circular 031 para la socialización de nuevos formatos (listas de chequeo para cada modalidad de contratación, estudios previos, certificado no planta). Se dio capacitación sobre el cambio en los formatos el pasado 22 de noviembre de 2022 a los enlaces de contratación de cada área. \nhttps://drive.google.com/drive/folders/1WiPXcluzad6wXbw9to2KtnWdaPRugt2P?usp=share_link \n\n3.  Se envía al área de Recursos Humanos la solicitud de capacitaciones en contratación. ver correo enviado por Secretaria General GUION CONTENIDOS PARA PROGRAMA DE INDUCCIÓN FUNCIONARIOS Y CONTRATISTAS. https://drive.google.com/drive/u/1/folders/1uZpeOuBr_8ivHEy_QkoeI4eBgOqh6DGW\n\n\nEl manual de contratación institucional está siendo actualizado normativamente, una vez se tenga el manual de contratación con los ajustes y actualizaciones normativas requeridas se solicitará al área de Recursos Humanos la capacitación en contratación. (a la fecha el manual cuenta con un avance del 90%)\nhttps://drive.google.com/drive/folders/1WiPXcluzad6wXbw9to2KtnWdaPRugt2P?usp=share_link \n\n\n  ","1. La Institución ejecuta los manuales de contratación y de supervisión e interventoría de acuerdo con revisión permanente realizada por la Oficina Asesora de Auditoría Interna. Adicionalmente, se presentó mejora en la supervisión de los contratos, de acuerdo con plan de mejora suscrito con la Contraloría General de Antioquia.\n\n2 y 3. El 14 de julio de 2022, se avanzó en la capacitación de supervisión e interventoría donde se explicó la responsabilidad administrativa, financiera, legal y técnica que significa ejecutar la misma y se socializó las mejoras a los informes de actividades y supervisión del proceso. \n\nDe acuerdo con revisión de la Oficina Asesora de Auditoría Interna, el plan de mejora suscrito con la Contraloría General de Antioquia se cumplió en un 100%, mejorando la supervisión de contratos.\n\nTambién se evidencia avance en la actualización del manual de Contratación.\n","No","No","Si","Si","Probabilidad","Moderado","Improbable",{"$f":"VLOOKUP($AN5, varios!$AK$2:$AL$4,2,FALSE)*VLOOKUP($AO5, varios!$AH$2:$AI$6, 2, FALSE)","v":10},{"$f":"VLOOKUP(AO5, varios!$Z$3:$AC$7, VLOOKUP(AN5, varios!$AE$2:$AF$4, 2, FALSE),FALSE)","v":"Bajo"},null,null,null,null,null,"Actividad desarrollada durante la vigencia 2022.",1]
["R2","Posibilidad de uso indebido o aplicación diferente de los bienes muebles o inmuebles de la IU. Digital de Antioquia para beneficio propio o de un tercero\n","Exceso de intereses propios o de terceros/\nFalta de ética y responsabilidad social, falta de procedimientos legales, Intereses particulares\n","Pérdida de bienes y recursos públicos/ detrimento patrimonial/ Afectación en la calidad de los\nbienes   por efecto el mal uso de los recursos\ninstitucionales. ","Si","No","No","No","Si","Si","Si","Si","Si","Si","Si","Si","Si","Si","Si","No","No","No","No",12,{"$f":"IF($X6 = 0, \"No Aplica\", IF($X6 <= 5, \"Moderado\", IF($X6 <= 11, \"Mayor\", \"Catastrófico\")))","v":"Catastrófico"},"No se ha presentado en los últimos 5 años",{"$f":"IF(Z6=\"Más de una vez al año\",\"5\",IF(Z6=\"Al menos una vez en el último año\",\"4\",IF(Z6=\"Al menos una vez en los últimos dos años\",\"3\",IF(Z6=\"Al menos una vez en los últimos 5 años\",\"2\",\"1\"))))","v":"1"},{"$f":"IF(AA6=\"5\",\"Casi seguro\",IF(AA6=\"4\",\"Probable\",IF(AA6=\"3\",\"Posible\",IF(AA6=\"2\",\"Improbable\",\"Rara vez\"))))","v":"Rara vez"},{"$f":"IF(Y6 = \"Moderado\", 5, IF(Y6 = \"Mayor\", 10, IF(Y6 = \"Catastrófico\", 20, 0)))*AA6","v":20},{"$f":"VLOOKUP($AB6, varios!$Z$3:$AC$7, VLOOKUP($Y6, varios!$AE$2:$AF$4, 2, FALSE),FALSE)","v":"Moderado"},"1. Implementación de procedimientos de usos de bienes y espacios institucionales\n2. Actualización periódica de inventarios\n3. Implementación de procedimiento para seguimiento y uso efectivo de las herramientas informáticas","1. Dirección de Servicios Generales\n2. Dirección de Servicios Generales\n3. Dirección de Tecnología","1. Se tienen diferentes procedimientos que rigen el área de Servicios Generales y dan respuesta a este control, permanentemente son implementados: https://drive.google.com/drive/folders/1O4ihYyeW8I7s2KiCPG21wPRGw0vJkn3K?usp=sharing \n\n2. Los inventarios y carteras personalizadas de cada uno de los funcionarios se verifican y actualizan de manera permanente, teniendo al día la totalidad de las carteras definidas en el artículo séptimo de la Resolución Rectoral No. 203 de 2020. \nComo forma de Control se cuenta con el auto inventario y la toma física que es realizada por el área de Bienes y Servicios con cada uno de funcionarios de la Institución en cualquier momento o cuando se solicite.\nComo una medida de verificación de las cantidades y del debido uso de los bienes de la IU. Digital, tal y como lo indica la Actividad No. 1 del procedimiento “INVENTARIO FÍSICO O AUTOINVENTARIO DE LOS BIENES DEVOLUTIVOS” código GL-P-03 Versión 01, el área responsable elabora la “programación anual de inventario físico de bienes devolutivos”, la cual una vez este ajustada, acorde con la Actividad No. 3 del procedimiento será notificada a través de correo electrónico a los funcionarios de la institución.\nPosteriormente, esta articulado con la validación entre cartera de inventarios vs (PPYE) propiedad, planta y equipo que se registran con el área de Contabilidad.\"\nEvidencias: Correo electrónico de notificación en equipo de Bienes y Servicios. \n\nSe tienen dos resoluciones que rigen el proceso de actualización periódica de inventario los cuales son: Resolución 203 y  Resolución 526 creación de comité de bienes. https://drive.google.com/drive/folders/1SghYwoGUnNRZAEM_0kt67glzjr9fVeR8?usp=sharing\n\n3. Actualmente el Proceso de Gestión Tecnológica, cuenta con un formulario para el registro de las necesidades de hardware y software de acuerdo a los requerimientos de los equipos de trabajo. \n\nFormulario web para la solicitud de licencias\n\nhttps://docs.google.com/forms/d/e/1FAIpQLSdJSM58HelH0GuQqZUkJ2KXWNaeZa_XhFGLiXifcCOfUqpHWw/viewform\n\nFormulario web para la solicitud de equipos:\n\nhttps://docs.google.com/forms/d/1hsGXKfhfhMKU1TI1J69ZFpI_BHV8xnhPpw_Sh6hVkKc/viewform?gxids=7628&edit_requested=true#responses","1. Desde el Modelo de Operación por Procesos se tiene establecidos los procedimientos de baja de bienes obsoletos e inservibles, inventario físico o autoinventario bienes devolutivos, gestión y mantenimiento de bienes, aseguramiento de bienes devolutivos. Adicionalmente, se documentó la Resolución 1033 de agosto de 2022, por medio de la cual se crea el Comité Evaluador de Bienes y se reglamentan los procedimientos de baja y enajenación de bienes muebles de propiedad de la Institución donde la Oficina Asesora de Auditoría Interna es invitada permanente con voz, pero sin voto.\n\n2. Se tiene establecido el procedimiento de inventario físico o autoinventario bienes devolutivos y de acuerdo a los cambios que presenten los activos, se procede con su actualización.\n\n3. Se cuenta con formularios que permiten controlar las solicitudes de herramientas informáticas a través de: \n\nFormulario web para la solicitud de licencias: https://docs.google.com/forms/d/e/1FAIpQLSdJSM58HelH0GuQqZUkJ2KXWNaeZa_XhFGLiXifcCOfUqpHWw/viewform\n\nFormulario web para la solicitud de equipos:\nhttps://docs.google.com/forms/d/1hsGXKfhfhMKU1TI1J69ZFpI_BHV8xnhPpw_Sh6hVkKc/viewform?gxids=7628&edit_requested=true#responses\n\n\n\n\n\n\n\n\n\n","No","No","Si","Si","Probabilidad","Moderado","Rara vez",{"$f":"VLOOKUP($AN6, varios!$AK$2:$AL$4,2,FALSE)*VLOOKUP($AO6, varios!$AH$2:$AI$6, 2, FALSE)","v":5},{"$f":"VLOOKUP(AO6, varios!$Z$3:$AC$7, VLOOKUP(AN6, varios!$AE$2:$AF$4, 2, FALSE),FALSE)","v":"Bajo"},null,null,null,null,null,"Actividad desarrollada durante la vigencia 2022.",1]
{"$rows_left_out":18}
{"sheet":"Acerno_Cache_XXXXX","index":1,"n_rows":0,"n_cols":0,"rows_kept":0,"cut":false,"hidden":true,"merged":[]}

{"sheet":"2. Mapa de Calor","index":2,"n_rows":10,"n_cols":11,"rows_kept":10,"cut":false,"hidden":true,"merged":[[0,1,0,4],[0,7,0,10],[2,5,6,5],[9,2,9,4],[9,8,9,10]]}
[null,"MAPA DE CALOR - RIESGO INICIAL",null,null,null,null,null,"MAPA DE CALOR - RIESGO RESIDUAL"]
[]
[5,"Casi seguro",null,null,null,"PROBABILIDAD",5,"Casi seguro"]
[4,"Probable",null,null,null,null,4,"Probable"]
[3,"Posible",null,null,null,null,3,"Posible"]
[2,"Improbable",null,null,null,null,2,"Improbable",null,null,"R5 - "]
{"$rows_left_out":5}
{"sheet":"Matriz Calificacion","index":3,"n_rows":46,"n_cols":6,"rows_kept":46,"cut":false,"hidden":true,"merged":[[19,0,42,0],[19,1,23,1],[24,1,28,1],[29,1,33,1],[34,1,38,1],[39,1,42,1],[0,0,0,5],[3,0,12,0],[3,1,4,1],[3,2,4,2],[5,1,6,1],[5,2,6,2],[7,2,8,2],[7,1,8,1],[9,1,10,1],[15,3,15,5],[39,2,42,2],[45,3,45,5],[9,2,10,2],[11,1,12,1],[11,2,12,2],[19,2,23,2],[24,2,28,2],[29,2,33,2],[34,2,38,2]]}
["Matriz para determinar el Grado de Criticidad de los Riesgos de Corrupción"]
[]
[]
["PROBABILIDAD",5,"Casi seguro","Moderado","Alto","Extremo"]
[null,null,null,25,50,100]
[null,4,"Probable","Moderado","Alto","Extremo"]
{"$rows_left_out":41}
{"sheet":"varios","index":4,"n_rows":99,"n_cols":38,"rows_kept":99,"cut":false,"hidden":true,"merged":[[0,15,0,20],[0,22,0,23],[0,25,0,28],[0,30,0,31]]}
["CATEGORÍA",null,"SUBCATEGORÍA",null,"FRECUENCIA","VALOR",null,"IMPACTO","VALOR",null,"DEPENDENCIA RIESGOS","codigo",null,"dependencia padre",null,"Matriz Riesgos Generales (freq)",null,null,null,null,null,null,"Tabla Impacto",null,null,"Matriz Riesgos Corrupción (freq)",null,null,null,null,"Tabla Impacto",null,null,"FRECUENCIA","VALOR",null,"IMPACTO","VALOR"]
["I_Financieros",null,"1.1 Asociados a la liquidéz",null,"Casi seguro",5,null,"Catastrófico",5,null,"Rectoría",1,null,"Rectoría",null,null,"Insignificante","Leve","Moderado","Severo","Catastrófico",null,"Insignificante",2,null,null,"Moderado","Mayor","Catastrófico",null,"Moderado",2,null,"Casi seguro",5,null,"Catastrófico",20]
["II_Estratégicos",null,"1.2 Asociados al presupuesto",null,"Probable",4,null,"Severo",4,null,"Secretaría General",2,null,"Rectoría",null,"Casi seguro","Moderado","Alto","Alto","Extremo","Extremo",null,"Leve",3,null,"Casi seguro","Moderado","Alto","Extremo",null,"Mayor",3,null,"Probable",4,null,"Mayor",10]
["III_Operacionales",null,"1.3 Asociados a proyectos de inversión",null,"Posible",3,null,"Moderado",3,null,"División de Gestión Documental",2.1,null,"Secretaría General",null,"Probable","Bajo","Moderado","Alto","Extremo","Extremo",null,"Moderado",4,null,"Probable","Moderado","Alto","Extremo",null,"Catastrófico",4,null,"Posible",3,null,"Moderado",5]
["IV_Legales",null,"1.4 Otros riesgos financieros",null,"Improbable",2,null,"Leve",2,null,"Departamento de Publicaciones",2.2000000000000002,null,"Secretaría General",null,"Posible","Bajo","Moderado","Alto","Extremo","Extremo",null,"Severo",5,null,"Posible","Moderado","Alto","Extremo",null,null,null,null,"Improbable",2]
["V_Corrupción",null,"2.1 Asociados al Plan de Desarrollo",null,"Rara vez",1,null,"Insignificante",1,null,"Vicerrectoría Administrativa",3,null,"Rectoría",null,"Improbable","Bajo","Moderado","Alto","Alto","Extremo",null,"Catastrófico",6,null,"Improbable","Bajo","Moderado","Alto",null,null,null,null,"Rara vez",1]
{"$rows_left_out":93}